has company activity type
type: ObjectProperty
domain: PrivateOrganization
comment: Property that links the private organization to its purpose or type of activity
sub property of: hasActivityType
version info: provvisoria @it
comment: Proprietà che lega l'organizzazione privata al suo scopo o tipo di attività svolta @it
label: has private organization activity type
label: ha tipo attività organizzazione privata @it
label: tipo di attività di azienda @it
range: PrivateOrgActivityType
version info: unstable