organization acronym
type: DatatypeProperty
type: FunctionalProperty
version info: stable
version info: stabile @it
comment: Questa proprietà rappresenta l'acronimo dell'organizzazione. @it
comment: This property represents the acronym of the organization.
label: acronimo organizzazione @it
domain: Organization
sub property of: name
range: Literal