acronimo organizzazione
type: DatatypeProperty
type: FunctionalProperty
comment: Questa proprietà rappresenta l'acronimo dell'organizzazione.
comment: This property represents the acronym of the organization. @en
domain: Organization
label: organization acronym @en
range: Literal
sub property of: name
version info: stable @en
version info: stabile