participated
type: ObjectProperty
domain: Participation
label: partecipata @it
version info: provvisoria @it
comment: This property links the situation of participation of an organization to an organization. Specifically this property models the fact that an organization is participated by another one.
range: Organization
version info: unstable
comment: Questa proprietà collega la situazione partecipazione di un'organizzazione all0organizzazione. In particolare, questa proprietà modella il fatto che un'organizzazione è partecipata dall'altra. @it