partecipante
type: ObjectProperty
comment: Questa proprietà collega un'organizzazione alla situazione partecipazione. In particolare, la proprietà modella il fatto che un'organizzazione partecipa in un'altra.
comment: This property links the organization to the situation partecipation. The property models the fact that an organization participates in another one. @en
domain: Organization
label: participating @en
range: Participation
version info: unstable @en
version info: provvisoria