participation percentage
type: DatatypeProperty
sub property of: value
version info: stable
version info: stabile @it
range: Literal
comment: This property represents the percentage of participation (share) of an organization in another during a time period.
label: percentuale di partecipazione @it
domain: Participation
comment: Questa proprietà rappresenta la percentuale (quota) di partecipazione di un'organizzazione in un'altra in un certo lasso temporale. Esempio "2.38"). La proprietà è molto utile nei casi di descrizione di società partecipate per esempio. @it