resulted from
type: ObjectProperty
version info: stable
version info: stabile @it
inverse of: resultingOrganization
label: risultante da @it
range: ChangeEvent
comment: Questa proprietà è l'inversa di organizzazione risultante e lega un'organizzazione all'evento di cambiameno attraverso cui l'organizzazione si è originata. @it
comment: This property is the inverse of resulting organization and links an organization to the change event through which the organization has been created.
domain: Organization