risultante da
type: ObjectProperty
comment: Questa proprietà è l'inversa di organizzazione risultante e lega un'organizzazione all'evento di cambiameno attraverso cui l'organizzazione si è originata.
comment: This property is the inverse of resulting organization and links an organization to the change event through which the organization has been created. @en
domain: Organization
label: resulted from @en
range: ChangeEvent
inverse of: resultingOrganization
version info: stable @en
version info: stabile