tax code
type: FunctionalProperty
type: DatatypeProperty
domain: Organization
range: Literal
label: codice fiscale organizzazione @it
comment: Questa proprietà rappresenta il codice fiscale dell'organizzazione sia essa pubblica che privata. Nel caso di imprese private il codice fiscale e la partita iva, tranne eccezioni, sono sempre coincidenti per le società, e sempre differenti per le imprese individuali. Il numero "Registro Imprese", ovvero il numero di iscrizione attribuito dal Registro Imprese della Camera di Commercio per le organizzazioni private, è il Codice Fiscale; nel caso si tratti di impresa individuale sarà il Codice Fiscale del titolare. @it
comment: This property represents the tax code of an organization.
sub property of: identifier
version info: stable
version info: stabile @it