ammontare totale
type: DatatypeProperty
label: total amount @en
version info: stable @en
version info: stabile
domain: BalanceSheet
comment: This property represents the total amount of the balance sheet of an organization. @en
comment: Questa proprietà rappresenta l'ammontare totale del bilancio di un'organizzazione.
range: float