Public Event
type: Class
comment: This class represents a public event (e.g., a football match, a conference, a book presentation, etc.). A public event is defined as an event that takes places in a given place and that occurs at a certain time, organised/run/promoted by one or more agents with a specific purpose and in the interest of a general public. There exist different types of public events depending on their size and content.
comment: Questa classe rappresenta un evento pubblico (e.g., una partita di calcio, una mostra, la presentazione di un libro, una fiera, ecc.). Un evento che si tiene in un determinato luogo e che accade a un certo tempo, organizzato/gestito da uno o più agenti con uno specifico fine e nell’interesse di un pubblico generale. Esistono diversi tipi di eventi pubblici in base alla loro dimensione e in base al loro contenuto @it
label: Evento Pubblico @it
subclass of: Event
subclass of: Restriction
  max qualified cardinality: 1
  on class: Playbill
  on property: hasPlaybill
subclass of: Restriction
  on property: takesPlaceIn
  some values from: PointOfInterest
subclass of: Restriction
  on property: hasPublicEventTypology
  some values from: PublicEventTypology
subclass of: Restriction
  all values from: Literal
  on property: shortEventTitle
subclass of: Restriction
  all values from: Offer
  on property: hasOffer
subclass of: Restriction
  all values from: Literal
  on property: eventContentKeyword
subclass of: Restriction
  all values from: Review
  on property: hasReview
subclass of: Restriction
  all values from: Image
  on property: hasImage
subclass of: Restriction
  cardinality: 1
  on property: identifier
subclass of: Restriction
  on property: hasRiT
  some values from: TimeIndexedRole
subclass of: Restriction
  on property: eventTitle
  some values from: Literal
subclass of: Restriction
  all values from: Audience
  on property: targetAudience
subclass of: Restriction
  all values from: Literal
  on property: eventAbstract
subclass of: Restriction
  on property: description
  some values from: Literal
subclass of: Restriction
  all values from: OnlineContactPoint
  on property: hasOnlineContactPoint
subclass of: Restriction
  all values from: AccessCondition
  on property: hasAccessCondition
version info: stable
version info: stabile @it
was influenced by: Event