descrizione breve evento
type: DatatypeProperty
version info: stabile
version info: stable @en
comment: An abstract of the event (maximum 180 characters). For a full description of the event, use the property l0:description @en
comment: Una breve descrizione (abstract) dell'evento. Per una descrizione completa, è necessario usare la proprietà description definita in l0.
range: Literal
label: abstract event @en
domain: PublicEvent
sub property of: description