abstract event
type: DatatypeProperty
comment: An abstract of the event (maximum 180 characters). For a full description of the event, use the property l0:description
comment: Una breve descrizione (abstract) dell'evento. Per una descrizione completa, è necessario usare la proprietà description definita in l0. @it
domain: PublicEvent
label: descrizione breve evento @it
range: Literal
sub property of: description
version info: stabile @it
version info: stable