ospita
type: ObjectProperty
domain: PointOfInterest
label: hosts @en
comment: Proprietà utilizzata per indicare che un certo punto di interesse ospita un evento pubblico
comment: Property used to represent that a Point of Interest hosts a public event @en
version info: stabile
version info: stable @en
inverse of: takesPlaceIn
range: PublicEvent