ospita
type: ObjectProperty
comment: Proprietà utilizzata per indicare che un certo punto di interesse ospita un evento pubblico
comment: Property used to represent that a Point of Interest hosts a public event @en
domain: PointOfInterest
label: hosts @en
range: PublicEvent
inverse of: takesPlaceIn
version info: stabile
version info: stable @en