Evento della vita per attività d'impresa
type: Class
controlled vocabulary: business-event
comment: This class represent a Business Event. A Business Event is a specific situation or event in the lifecycle of a business (professionals). A Business Event requires a set of public services to be delivered in order for the associated business need(s) or obligation(s) to be fulfilled. The individuals of this class are those elements of the controlled vocabulary https://w3id.org/italia/controlled-vocabulary/classifications-for-public-services/life-business-event/business-event @en
version info: stabile
version info: stable @en
label: Business Event @en
comment: La classe rappresenta un evento di business dove un evento di business è una situazione o evento che si verifica nel ciclo di vita di un business. Un evento di business richiede che un insieme di servizi pubblici siano erogati per far sì che le necessità e obbligazioni dell'evento di business siano effettivamente soddisfatte. Esempio di evento di business può essere l'avvio di una pratica con la pubblica amministrazione, la chiusura di un'azienda, ecc. Gli individi di questa classe sono tutti gli elementi del vocabolario controllato https://w3id.org/italia/controlled-vocabulary/classifications-for-public-services/life-business-event/life-event
subclass of: EventOrSituation