Channel
type: Class
comment: This class represents a channel through which a service is provided to end-users. In the context of CPSV-AP_IT the type of the channel must be controlled by using the following controlled vocabulary https://w3id.org/italia/controlled-vocabulary/classifications-for-public-services/channel. The class is recommended.
comment: Questa classe rappresenta un canale attraverso cui il servizio pubbico è erogato agli utenti finali. In CPSV-AP_IT il tipo di canale deve essere specificato attraverso il seguente vocabolario per la definizione del tipo di canale: https://w3id.org/italia/controlled-vocabulary/classifications-for-public-services/channel. La classe è raccomandata. @it
label: Canale di erogazione @it
subclass of: Object
subclass of: Restriction
  max qualified cardinality: 1
  on class: AccessCondition
  on property: hasAccessCondition
subclass of: Restriction
  all values from: Service
  on property: isChannelOf
subclass of: Restriction
  all values from: Cost
  on property: hasCost
subclass of: Restriction
  on class: ChannelType
  on property: hasChannelType
  qualified cardinality: 1
version info: stabile @it
version info: stable