Legge
type: Class
comment: Questa classe rappresenta il riferimento normativo che sottende le regole che governano il servizio pubblico. La classe è opzionale.
comment: This class represents the legislation, policy or policies that lie behind the rules that govern the service. The class is optional. @en
label: Formal Framework @en
label: Framework Legale
label: Legislazione
subclass of: System
subclass of: Restriction
  all values from: anyURI
  on property: referenceDoc
subclass of: Restriction
  some values from: Literal
  on property: name
subclass of: Restriction
  all values from: Literal
  on property: description
subclass of: Restriction
  cardinality: 1
  on property: identifier
version info: stabile
version info: stable @en