Interactivity Level
type: Class
controlledvocabulary: interactivity-level
version info: stable
comment: Questa classe rappresenta il livello di interattività per un servizio pubblico. Il livello di interattività è il livello di interazione con l'utenza del servizio (si vedano le Linee guida per i siti web delle PA ‐ 2011). Le istanze di questa classe sono voci di un vocabolario controllato modellato anche mediante l'uso di SKOS. Il vocabolario controllato che deve essere utilizzato per le istanze di questa classe è https://w3id.org/italia/controlled-vocabulary/classifications-for-public-services/interactivity-level @it
label: Livello di Interattività @it
version info: stabile @it
comment: This class represents the level of interactivity for a public service. The level of interactivity is the level of interaction with the users of the service (see the Italian Guidelines for the websites of the Public Administrations - 2011). Instances of this class are the items of a controlled vocabulary modeled also through the use of SKOS. The controlled vocabulary to be used for the instances of this class is https://w3id.org/italia/controlled-vocabulary/classifications-for-public-services/interactivity-level
subclass of: Characteristic