Regola
type: Class
subclass of: Restriction
  cardinality: 1
  on property: identifier
subclass of: Restriction
  some values from: Literal
  on property: description
subclass of: Restriction
  all values from: FormalFramework
  on property: implementsFF
subclass of: Restriction
  some values from: Literal
  on property: name
subclass of: System
subclass of: Restriction
  all values from: Service
  on property: isFollowedByService
subclass of: Restriction
  all values from: anyURI
  on property: referenceDoc
subclass of: Restriction
  all values from: Requirement
  on property: specifiesReq
label: Rule @en
label: Linea guida
label: Regola tecnica
version info: stable @en
version info: stabile
comment: La classe "Regola" rappresenta un documento che definisce le regole tecniche, le linee guida e qualsiasi altra procedura che il servizio pubblico deve seguire. La regola include i termini di utilizzo o requisiti del servizio pubblico. I requisiti possono essere requisiti di licenza, di standard adottati, di autenticazione, ecc. La classe è raccomandata.
comment: The Rule class represents a document that sets out the specific rules, guidelines or procedures that the Public Service follows. It includes the terms of service or requirements that can be licence, standard, authentication requirements of the Public Service. The class is recommended. @en