Sottotema del Servizio
type: Class
version info: stabile
label: Service Sector @en
subclass of: Characteristic
comment: Questa classe rappresenta le istanze del vocabolario controllato utilizzato per modellare il settore del servizio. Il vocabolario controllato è NACE http://ec.europa.eu/eurostat/ramon/nomenclatures/index.cfm?TargetUrl=LST_NOM_DTL&StrNom=NACE_REV2&StrLanguageCode=IT
comment: This class represents the instances of the controlled vocabulary used to model the sector of the public service. The controlled vocabulary to be used is NACE http://ec.europa.eu/eurostat/ramon/nomenclatures/index.cfm?TargetUrl=LST_NOM_DTL&StrNom=NACE_REV2&StrLanguageCode=EN @en
label: Settore del Servizio
version info: stable @en