Service Theme
type: Class
comment: Questa classe è usata per modellare i temi associati ai servizi (tipicamente usati per esigenze di classificazione e ricerca). Le istanze di questa classe sono quelle del vocabolario controllato europeo Data Theme http://publications.europa.eu/resource/authority/data-theme @it
label: Tema del Servizio @it
comment: This class is used to model the themes associated with services (typically used for classification and search needs). The instances of this class are those of the European controlled vocabulary Data Theme http://publications.europa.eu/resource/authority/data-theme
subclass of: Characteristic
version info: stabile @it
version info: stable
controlledvocabulary: data-theme