ha tipo di evento
type: ObjectProperty
comment: Questa proprietà è utilizzata per collegare l'evento con il suo tipo.
range: EventType
version info: stabile
comment: This property is used to link the event to its type @en
version info: stable @en
label: has event type @en
domain: EventOrSituation