has input
type: ObjectProperty
comment: This property is used to link a service with an input required to carry out the service. A service can have more than one input.
comment: Questa proprietà è utilizzata per collegare un servizio all'input richiesto per poter espletare il servizio stesso. Il servizio può avere più di un input. @it
domain: Service
label: ha input @it
range: Input
version info: stable
version info: stabile @it