has processing time
type: ObjectProperty
label: ha tempo di lavorazione @it
range: ServiceProcessingTime
comment: Questa proprietà rappresenta il tempo di processamento che può essere espresso sia in termini quantitativi, sia in termini puntuali riferibili a un intervallo temporale. La proprietà connette la classe LifeEvent a sia Quantitative Value che Time Interval. @it
comment: This property represents the processing time for the service. It can be expressed in a quantitative time metric (e.g., 3 days, 1 week, 2 months, etc)
version info: stable
version info: stabile @it
domain: Service