ha tempo di lavorazione
type: ObjectProperty
comment: Questa proprietà rappresenta il tempo di processamento che può essere espresso sia in termini quantitativi, sia in termini puntuali riferibili a un intervallo temporale. La proprietà connette la classe LifeEvent a sia Quantitative Value che Time Interval.
comment: This property represents the processing time for the service. It can be expressed in a quantitative time metric (e.g., 3 days, 1 week, 2 months, etc) @en
domain: Service
label: has processing time @en
range: ServiceProcessingTime
version info: stable @en
version info: stabile