has service status
type: ObjectProperty
comment: Property used to link a public service with a status.
comment: CPSV
range: ServiceStatus
version info: stabile @it
label: ha stato del servizio @it
version info: stable
domain: Service
inverse of: isStatusForService
comment: Proprietà utilizzata per collegare un servizio pubblico a uno stato. @it