ha livello di interattività
type: ObjectProperty
comment: Questa proprietà consente di rappresentare il livello di interattività del servizio. Il livello di interattività deve essere specificato mediante l'uso del vocabolario controllato: https://w3id.org/italia/controlled-vocabulary/classifications-for-public-services/interactivity-level
version info: stabile
range: InteractivityLevel
version info: stable @en
comment: this property is used to represent the interactivity level of the service. The interactivity level must be chosen through the use of the following controlled vocabulary: https://w3id.org/italia/controlled-vocabulary/classifications-for-public-services/interactivity-level @en
label: has interactivity level @en
domain: PublicService