è canale di
type: ObjectProperty
comment: Proprietà inversa di "ha canale" utilizzata per collegare un canale con un servizio.
comment: Inverse property of "has channel" used to link a channel with the service. @en
range: Service
version info: stabile
version info: stable @en
label: is channel of @en
domain: Channel