è conforme a regola tecnica
type: ObjectProperty
comment: This property links a public service to the set of rules the service has to follow in order to be carried out. @en
domain: Service
comment: Questa proprietà è utilizzata per poter collegare il servizio pubblico all'insieme di regole che esso deve rispettare per il suo espletamento.
range: Rule
label: è conforme a regola
version info: stabile
version info: stable @en
label: is compliant with @en
inverse of: isFollowedByService
label: è conforme a linea guida