is event for public service
type: ObjectProperty
comment: This property is used to link an event (business, life event) with the public services that compose it.
range: PublicService
version info: stabile @it
domain: EventOrSituation
label: è evento per il servizio pubblico @it
comment: Questa proprietà è utilizzata per collegare un evento (di business o della vita di un cittadino) a tutti i servizi che lo compongono. @it
version info: stable