è fisicamente disponibile presso
type: ObjectProperty
label: is physically available at @en
version info: stabile
version info: stable
range: Feature
comment: CPSV
comment: This property links the service to its physical location in the case the service is provided offline at some organization's desk/totem. @en
comment: Questa proprietà collega un servizio alla locazione fisica che lo eroga nel caso il servizio sia offerto agli utenti finali (ad esempio via sportelli fisici/totem)
domain: Service
sub property of: hasChannel