altro identificativo associato al servizio
type: DatatypeProperty
version info: stabile
version info: stable @en
comment: This property is used to represent another code (for the integration with other data bases) associated with a public service. @en
comment: Questa proprietà è utilizzata per rappresentare un altro codice associato al servizio pubblico. Per esempio, nel caso di servizi di pagamento, tale proprietà potrebbe essere utilizzata per indicare il relativo codice gestionale SIOPE (Sistema informativo delle operazioni degli enti pubblici).
sub property of: identifier
range: Literal
label: altro codice servizio
label: other service code @en
domain: Service