documentazione di riferimento
type: DatatypeProperty
domain: Thing
range: Literal
label: reference documentation @en
comment: This property is used in order to model the URL of the reference documentation for Rule, FormalFramework, Input and TechnicalStandard. @en
comment: Questa proprietà è utilizzata per indicare gli URL della documentazione di riferimenti per alcuni oggetti quali Regola, Framework Legale, Input e Standard Tecnico.
version info: unstable @en
version info: provvisoria