relativo a servizio
type: SymmetricProperty
type: ObjectProperty
comment: Questa proprietà è utilizzata per rappresentare tutti quei casi in cui un servizio pubblico è in relazione (generica) con altri servizi.
comment: This property is used to represent all those cases in which a service relates to another services. @en
domain: Service
label: relation service @en
range: Service
version info: stabile
version info: stable @en