settore del servizio
type: ObjectProperty
label: service sector @en
version info: stabile
version info: stable @en
comment: Questa proprietà è utilizzata per specificare il sotto tema o settore del servizio. Il settore del servizio deve essere scelto sulla base del vocabolario controllato NACE. http://ec.europa.eu/eurostat/ramon/nomenclatures/index.cfm?TargetUrl=LST_NOM_DTL&StrNom=NACE_REV2&StrLanguageCode=IT
comment: This property is used to model the service subtheme or sector. The service subtheme must be choosen using a controlled vocabulary that is NACE. http://ec.europa.eu/eurostat/ramon/nomenclatures/index.cfm?TargetUrl=LST_NOM_DTL&StrNom=NACE_REV2&StrLanguageCode=EN @en
domain: PublicService
range: ServiceSector