tema del servizio
type: ObjectProperty
comment: Questa proprietà consente di specificare il tema del servizio. Il tema del servizio deve essere specificato utilizzando il seguente vocabolario controllato: http://publications.europa.eu/resource/authority/data-theme
comment: This property is used to model the service theme. The service theme must be specified using the following controlled vocabulary: http://publications.europa.eu/resource/authority/data-theme @en
domain: PublicService
label: service theme @en
range: ServiceTheme
version info: stabile
version info: stable @en