has language
type: ObjectProperty
comment: Property that links any thing with a language @en
comment: Proprietà che lega una qualsiasi cosa (e.g., servizio pubblico, punto di contatto, web site, etc.) con la sua lingua
range: Language
domain: Thing
label: ha lingua
inverse of: isLanguageOf