Measurement Unit
type: Class
version info: stable
version info: stabile @it
comment: This class is used to model a measurement unit (e.g., meter, kilometer, gram, etc.)
comment: Questa classe è utilizzata per rappresentare un'unità di misura (e.g., metro, chilometro, grammo, ecc.). @it
label: Unità di Misura @it
subclass of: Characteristic