is measure type of
type: ObjectProperty
version info: stable
version info: stabile @it
domain: MeasureType
comment: Inverse property of "has measure type" that links a measure type to the value.
comment: Proprietà inversa di "ha tipo di misura" che collega un tipo di misura al valore. @it
range: Value
label: è tipo misura di @it