descrizione dell'endpoint
type: ObjectProperty
range: Resource
domain: DataService
comment: La descrizione dell'endpoint fornisce dettagli specifici sull'endpoint stesso. La descrizione potrebbe essere espressa in una forma leggibile da macchine (machine-readable). Per esempio, una descrizione OpenAPI (Swagger), un servizio di descrizione SPARQL, ecc.
version info: unstable @en
label: endpoint description @en
version info: provvisorio
comment: A description of the services available via the endpoints, including their operations, parameters etc. @en