Multiple Point Of Interest
type: Class
comment: This class represents a collection of points of interest.
version info: stable
subclass of: PointOfInterest
version info: stabile @it
comment: Questa classe rappresenta una collezione di punti di interesse. Per esempio un centro commerciale è un punto di interesse ma a sua volta una collezioni di tanti punti di interesse (farmacia, negozi, ristoranti, cinema, ecc.) @it
label: Punto di Interesse Multiplo @it
subclass of: Restriction
  all values from: PointOfInterest
  on property: includesPOI