point of interest identifier
type: DatatypeProperty
type: FunctionalProperty
version info: stable
version info: stabile @it
comment: This property represents a unique identifier of the point of interest.
comment: Questa proprietà rappresenta l'identificativo univoco del punto di interesse. @it
domain: PointOfInterest
label: identificativo punto di interesse @it
range: Literal