Name in Time of the Point of Interest
type: Class
subclass of: Restriction
  all values from: Literal
  on property: POIalternativeName
subclass of: Restriction
  some values from: Literal
  on property: POIofficialName
subclass of: Restriction
  qualified cardinality: 1
  on class: PointOfInterest
  on property: isPOINameInTimeFor
subclass of: EventOrSituation
subclass of: Restriction
  qualified cardinality: 1
  on class: TimeInterval
  on property: atTime
comment: This class represents the situation of the name of the point of interest that changes over time. It is therefore represented as an ennary relationship between the point of interest, time and name. This class can be useful in case you want to trace the evolution of names of points of interest over time.
comment: Questa classe rappresenta la situazione del nome del punto di interesse che cambia nel tempo. Essa è rappresentata quindi come una relazione ennaria tra il punto di interesse, il tempo e il nome. Questa classe può essere utile nel caso si voglia tracciare l'evoluzione dei nomi di punti di interesse nel tempo. @it
version info: provvisoria @it
version info: unstable
label: Nome nel Tempo del Punto di Interesse @it