Point of Interest Status
type: Class
comment: This class represents the status of the point of interest. Its values can be fixed but vary according to the type of point of interest. For example, they may be "on duty","open","closed", etc. for pharmacies or "free","occupied" for parking, or "open","closed","under renovation" in the case of accommodation facilities, etc.
comment: Questa classe rappresenta lo stato del punto di interesse. I suoi valori possono essere fissati per tipologia di punto di interesse. Per esempio, essi possono essere "di turno", "aperta", "chiusa", ecc. per le farmacie oppure "libero", "occupato" per i parcheggi, oppure "aperto", "chiuso", "in ristrutturazione" nel caso di strutture ricettive, ecc. @it
label: Stato del Punto di Interesse @it
subclass of: Characteristic
subclass of: Restriction
  on property: POIstate
  some values from: Literal
subclass of: Restriction
  all values from: PointOfInterest
  on property: isPOIStateFor
version info: stable
version info: stabile @it