name of point of interest category
type: Property
type: DatatypeProperty
comment: This property represents the preferred label (name) of the category of the point of interest.
comment: Questa proprietà rappresenta l'etichetta (nome) della categoria del punto di interesse. @it
domain: PointOfInterestCategory
label: nome categoria del punto di interesse @it
range: Literal
version info: stable
version info: stabile @it
controlled vocabulary: poi-category-classification