descrizione del punto di interesse
type: DatatypeProperty
comment: Questa proprietà rappresenta una generica descrizione del punto di interesse.
comment: This property represents a generic description of the point of interest. @en
label: point of interest description @en
version info: stable @en
version info: stabile
domain: PointOfInterest
range: Literal