nome ufficiale del punto di interesse
type: DatatypeProperty
comment: Questa proprietà rappresenta il nome ufficiale del punto di interesse.
comment: This property represents the official name of the point of interest. @en
version info: stable @en
version info: stabile
label: point of interest official name @en
domain: Class
  union of: POINameInTime
  union of: PointOfInterest
range: Literal