valore dello stato del punto di interesse
type: DatatypeProperty
version info: stabile
comment: This property is the preferred label for the status of the point of interest. @en
label: status @en
comment: Questa proprietà rappresenta l'etichetta (stringa) dello stato del punto di interesse.
domain: POIState
version info: stable @en
range: Literal