Point of Interest Category
type: Class
comment: This class represents the category of the point of interest. It individuals can be data of a controlled vocabulary (that we will make available in the upcoming weeks and that will be inspired by the classification offered by Open Street Map). The controlled vocabulary identifies the general types of Points of Interest such as, "entertainament, food, public service, travel/tourism", etc. The individuals of this class can also be subclasses of the class "Point of Interest" (Punning)
comment: Questa classe rappresenta la categoria attraverso cui classificare il punto di interesse. Essa assume i valori di un vocabolario controllato (che sarà rilasciato nelle prossime settimane e ispirato dalla classificazione di Open Street Map) che identifica in linea generale i tipi di punti di interesse come per esempio: divertimento, cibo, servizio pubbico, viaggi/turismo, ecc. I suoi individui possono essere anche sottoclassi della classe Punto di Interesse (questa tecnica di modellazione in OWL si chiama Punning). @it
label: Categoria del Punto di Interesse @it
subclass of: Topic
subclass of: Restriction
  on property: POIcategoryName
  some values from: Literal
version info: stabile @it
version info: stable